{"text_format":"3","workbook":"xlsx","n_sheets":6,"sheets":["CSE Stipend Pmt Sep - 18","Sheet1","Jan 18","Sheet4","Argos data verification","Stipend Pmt Nov-19 "],"not_rendered":{"images":3,"external_links":1,"defined_names":3},"read":"whole","date_system":"1900"}

{"sheet":"CSE Stipend Pmt Sep - 18","index":0,"n_rows":95,"n_cols":15,"rows_kept":95,"hidden":true}
[]
[{"$nulls":4},"Stipend Payment for SEP/ 2018"]
[]
[]
[]
["Ref. HBKU/CSE/Stipend/XXX"]
["To:   Accounts Payable Manager / QF-Finance"]
["CC:   Executive Director / QF-Finance"]
["CC:  Chief Financial Officer / HBKU-Finance"]
["Date: 01/08/2018"]
[]
["Please arrange for the payment of QR 577,000/- stipend to the following students receiving scholarships via bank transfer to their respective below bank accounts. The HBKU account to be charged is HU.BA.856.725011 "]
[]
["#","QID Student Name ","Banner Student Name","Banner ID","Qatar ID","Admittance Year","Citizenship","College","Program","Amount","IBAN ","Bank Name","Swift Code","Status Check","Further Notes"]
[1,"Ahmad Najjar","Ahmad Najjar",210003922,28382600193,"2015-16","United Kingdom","CSE","Biomedical &Biological Science",9000,"QA39 QISB 0115 4313 0060 2001 3037 1 ","Qatar Islamic Bank (QIB) ",0,"Active",0]
[2,"Ahmed Sodiq","Ahmed Sodiq",210003956,28556600717,"2015-16","Nigeria","CSE",{"$error":"#N/A"},9000,"QA02 QNBA 0000 0000 0035 3751 7204 3","QNB",0,"Active",0]
[3,"Ahmer Balouch","Ahmer Ali Bozdar Baloch",210003976,28858604890,"2015-16","Pakistan","CSE","Sustainable Energy",9000,"QA94 QNBA 0000 0000 0035 3879 7904 3","QNB",0,"Active",0]
[4,"Faisal Mumtaz","Faisal Ahmed Mumtaz",210003977,29058603829,"2015-16","Pakistan","CSE","Sustainable Energy",9000,"QA14 QNBA 0000 0000 0035 3757 0804 3","QNB - Qatar Foundation","QNBAQAQA","Active",0]
[5,"Hajar Farzaneh","Hajar Ali Hussain Farzaneh",210003974,28736400101,"2015-16","Iran (Islamic Republic Of)","CSE","Sustainable Environment",9000,"QA34 QNBA 0000 0000 0027 3352 6904 3","QNB",0,"Active",0]
[6,"Ibrahim Ari","Ibrahim Ari",210003961,28379201466,"2015-16","Turkey","CSE","Sustainable Energy",9000,"QA84 QNBA 0000 0000 0035 3736 2904 3","QNB - Qatar Foundation","QNBAQAQA","Active",0]
{"$rows_left_out":76}
{"sheet":"Sheet1","index":1,"n_rows":254,"n_cols":10,"rows_kept":254,"hidden":true}
[]
["QID","SPRIDEN_ID","SPRIDEN_FIRST_NAME","SPRIDEN_MI","SPRIDEN_LAST_NAME","SFRSTCR_TERM_CODE","ADMIT_TERM","Name Full",null,"Nationality"]
["EB3088972",210004022,"Augusto","Manuel","Lucas",201820,201610,{"$f":"CONCATENATE(C3,\" \",D3,\" \",E3)","v":"Augusto Manuel Lucas"},"EB3088972","Philippines"]
[29743400006,210004850,"Abdulrahman","Mohamed","ElKelani",201820,201710,{"$f":"CONCATENATE(C4,\" \",D4,\" \",E4)","v":"Abdulrahman Mohamed ElKelani"},29743400006,"Libyan Arab Jamahiriya"]
[null,210007180,"Mohamed",null,"Al Mohannadi",201820,201810,"Mohamed  Al Mohannadi",null,"Qatar"]
[29863401677,210004028,"Mohamed","Ahmed","Al-horr",201820,201610,"Mohamed Ahmed Al-horr",29863401677,"Qatar"]
[29860800243,210004650,"Johanne Gren","Duhay","Medina",201820,201710,"Johanne Gren Duhay Medina",29860800243,"Philippines"]
[29758601464,210004655,"Shaheer","Ahmed","Bakali",201820,201710,"Shaheer Ahmed Bakali",29758601464,"Pakistan"]
[29899900257,210004732,"Rania",null,"Elsharafa",201820,201710,"Rania  Elsharafa",29899900257,"Palestinian Territory, Occupie"]
[null,210004890,"Tala","Basem","Anabtawi",201820,201710,"Tala Basem Anabtawi",null,"United States"]
[29981800536,210007477,"Mahmoud","Mohamed","ELraei",201820,201810,"Mahmoud Mohamed ELraei",29981800536,"Egypt"]
[29858601871,210007760,"Asra","Saeed","Bashir",201820,201810,"Asra Saeed Bashir",29858601871,"Pakistan"]
[29581802527,210005311,"Omar","Elwalid","Elshal",201820,201710,"Omar Elwalid Elshal",29581802527,"Egypt"]
[null,210007479,"Ghassan","Marwan","Saad",201820,201810,"Ghassan Marwan Saad",null,"Palestinian Territory, Occupie"]
[30081800701,210007753,"Shorok",null,"Ayman",201820,201810,"Shorok  Ayman",30081800701,"Egypt"]
[null,210005246,"Mohamed",null,"Amara",201820,201710,"Mohamed  Amara",null,"Tunisia"]
[29163403713,210005479,"Mohammad","Ahmad","Al-Sooj",201820,201710,"Mohammad Ahmad Al-Sooj",29163403713,"Qatar"]
[29805000160,210005821,"Zinia","Jaha","Jalal",201820,201810,"Zinia Jaha Jalal",29805000160,"Bangladesh"]
[29873600071,210004020,"Almiqdad","Jamal Musa","Elzein",201820,201610,"Almiqdad Jamal Musa Elzein",29873600071,"Sudan"]
[29735601200,210004030,"Safiya",null,"Jan",201820,201610,"Safiya  Jan",29735601200,"India"]
{"$rows_left_out":235}
{"sheet":"Jan 18","index":2,"n_rows":145,"n_cols":8,"rows_kept":145,"hidden":true,"merged":[[37,6,37,7],[38,6,38,7],[87,6,87,7],[88,6,88,7],[143,6,143,7],[144,6,144,7]]}
[]
[]
[]
[]
[]
["Ref. HBKU/CSE/Stipend/031"]
["To:   Accounts Payable Manager / QF-Finance"]
["CC:   Executive Director / QF-Finance"]
["CC:  Chief Financial Officer / HBKU-Finance"]
["Date: 16/01/2018"]
[]
["Subject: Stipend payment request for the month of Jan 2018"]
[]
["Please arrange for the payment of QR 124,000/- stipend to the following students receiving scholarships via bank transfer to their respective below bank accounts: "]
[]
[null,"Student Name","Citizenship","University","Amount","IBAN ","Bank Name","Swift Code"]
[1,"Tejvir Singh","India","HBKU",{"v":9000,"d":"9,000"},"QA13 QNBA 0000 0000 0230 3767 6804 3","QNB - Qatar Foundation"]
[2,"Waqas Nawaz","Pakistan","HBKU",{"v":9000,"d":"9,000"},"QA72 QNBA 0000 0000 0035 2471 6900 1","QNB - Qatar Foundation","QNBAQAQAXXX"]
[3,"Ahmed Sodiq","Nigeria","HBKU",{"v":9000,"d":"9,000"},"QA02 QNBA 0000 0000 0035 3751 7204 3","QNB"]
[4,"Ahmad Najjar","UK","HBKU",{"v":9000,"d":"9,000"},"QA39 QISB 0115 4313 0060 2001 3037 1 ","Qatar Islamic Bank (QIB) "]
{"$rows_left_out":126}
{"sheet":"Sheet4","index":3,"n_rows":88,"n_cols":9,"rows_kept":88,"hidden":true}
[]
[null,"Student Name","Admittance Year","Citizenship","University","Amount","IBAN ","Bank Name","Swift Code"]
[1,"Tejvir Singh","2015-16","India","HBKU",{"v":9000,"d":"9,000"},"QA13 QNBA 0000 0000 0230 3767 6804 3","QNB - Qatar Foundation"]
[2,"Waqas Nawaz","2015-16","Pakistan","HBKU",{"v":9000,"d":"9,000"},"QA72 QNBA 0000 0000 0035 2471 6900 1","QNB - Qatar Foundation","QNBAQAQAXXX"]
[3,"Ahmed Sodiq","2015-16","Nigeria","HBKU",{"v":9000,"d":"9,000"},"QA02 QNBA 0000 0000 0035 3751 7204 3","QNB"]
[4,"Ahmad Najjar","2015-16","UK","HBKU",{"v":9000,"d":"9,000"},"QA39 QISB 0115 4313 0060 2001 3037 1 ","Qatar Islamic Bank (QIB) "]
[5,"Ibrahim Ari","2015-16","Turkey","HBKU",{"v":9000,"d":"9,000"},"QA84 QNBA 0000 0000 0035 3736 2904 3","QNB - Qatar Foundation","QNBAQAQA"]
[6,"Shoukat Alim Khan","2015-16","Pakistan","HBKU",{"v":9000,"d":"9,000"},"QA43 QNBA 0000 0000 0035 3757 1004 3","QNB - Qatar Foundation","QNBAQAQA"]
[7,"Nurettin Sezer","2015-16","Turkey","HBKU",{"v":9000,"d":"9,000"},"QA21 QNBA 0000 0000 0035 3736 2804 3","QNB - Qatar Foundation","QNBAQAQA"]
[8,"Irfan Batur","2015-16","Turkey","HBKU",{"v":9000,"d":"9,000"},"QA40 QNBA 0000 0000 0035 3751 8804 3","QNB - Qatar Foundation","QNBAQAQA"]
[9,"Faisal Ahmed Mumtaz","2015-16","Pakistan","HBKU",{"v":9000,"d":"9,000"},"QA14 QNBA 0000 0000 0035 3757 0804 3","QNB - Qatar Foundation","QNBAQAQA"]
[10,"Mohamed Atta Elmanan Bakhit Alhaj","2015-16","Sudan","HBKU",{"v":9000,"d":"9,000"},"QA78 QISB 0000 0000 0150 4583 6001 0 ","Qatar Islamic Bank QIB"]
[11,"Shahzada Pamir Aly","2015-16","Pakistan","HBKU",{"v":9000,"d":"9,000"},"QA72 QNBA 0000 0000 0035 3757 1204 3","QNB","QNBAQAQA"]
[12,"Hajar Ali Hussain Farzaneh","2015-16","Iran","HBKU",{"v":9000,"d":"9,000"},"QA34 QNBA 0000 0000 0027 3352 6904 3","QNB"]
[13,"Ahmer Ali Bozdar Baloch","2015-16","Pakistan","HBKU",{"v":9000,"d":"9,000"},"QA94 QNBA 0000 0000 0035 3879 7904 3","QNB"]
[14,"Sanaa Sharari","2015-16","Palestine","HBKU",{"v":7000,"d":"7,000"},"QA76 QNBA 0000 0000 0035 3859 1404 3","QNB"]
[1,"Abdulghani Khilan","2016-17","Syria","HBKU",{"v":9000,"d":"9,000"},"QA59 QNBA 0000 0000 0035 4116 6804 3","QNB - Qatar Foundation","QNBAQAQA"]
[2,"Arwa Aldaalis","2016-17","Palestinian","HBKU",{"v":9000,"d":"9,000"},"QA68 QISB 0109 4889 0110 1001 7190 7","Qatar Islamic Bank"]
[3,"Ayat Hammad","2016-17","Jordan","HBKU",{"v":9000,"d":"9,000"},"QA76 MAFR 0000 0000 0006 5113 0800 1","Masraf Al Rayan"]
[4,"Bushra Memon","2016-17","India","HBKU",{"v":7500,"d":"7,500"},"QA36 QISB 0121 2645 0020 2001 6259 1","Qatar Islamic Bank (QIB)"]
{"$rows_left_out":69}
{"sheet":"Argos data verification","index":4,"n_rows":259,"n_cols":22,"rows_kept":259,"hidden":true}
["QID","SPRIDEN_ID","SPRIDEN_FIRST_NAME","SPRIDEN_MI","SPRIDEN_LAST_NAME","SFRSTCR_TERM_CODE","ADMIT_TERM","STATUS","COLLEGE","Level","DEGREE","SPONSOR","SCHOLOARSHIP","ANNUAL_INVOICE","MAJOR","PROGRAM","Email","Nationality","Preffered_Phone","alternative_Phone"]
[29701200074,210004050,"Selmane","Nouar","Tabet",201820,201610,"Active","Science & Engineering","Undergraduate","Bachelor of Science"," ",null," ","Computer Engineering","BSc in Computer Engineering","SELTABET@hbku.edu.qa","Algeria",{"$f":"974-33693992","v":-33693018},{"$f":"974-33057812","v":-33056838},null,29701200074]
[29743400006,210004850,"Abdulrahman","Mohamed","ElKelani",201820,201710,"Active","Science & Engineering","Undergraduate","Bachelor of Science"," ",null," ","Computer Engineering","BSc in Computer Engineering","aelkelani@hbku.edu.qa","Libyan Arab Jamahiriya",-9747765151,null,null,29743400006]
["EB3088972",210004022,"Augusto","Manuel","Lucas",201820,201610,"Active","Science & Engineering","Undergraduate","Bachelor of Science"," ",null," ","Computer Engineering","BSc in Computer Engineering","AUGLUCAS@hbku.edu.qa",{"$nulls":4},"EB3088972"]
[null,"Philippines","974-33409868","974-55534398"]
[29858601871,210007760,"Asra","Saeed","Bashir",201820,201810,"Active","Science & Engineering","Undergraduate","Bachelor of Science"," ",null," ","Computer Engineering","BSc in Computer Engineering","assaeed@hbku.edu.qa","Pakistan","0092-3370386746",null,null,29858601871]
[29860800243,210004650,"Johanne Gren","Duhay","Medina",201820,201710,"Active","Science & Engineering","Undergraduate","Bachelor of Science"," ",null," ","Computer Engineering","BSc in Computer Engineering","jmedina@hbku.edu.qa","Philippines","974-66067279",null,null,29860800243]
[29758601464,210004655,"Shaheer","Ahmed","Bakali",201820,201710,"Active","Science & Engineering","Undergraduate","Bachelor of Science"," ",null," ","Computer Engineering","BSc in Computer Engineering","sbakali@hbku.edu.qa","Pakistan","974-33842949",null,null,29758601464]
[29899900257,210004732,"Rania",null,"Elsharafa",201820,201710,"Active","Science & Engineering","Undergraduate","Bachelor of Science"," ",null," ","Computer Engineering","BSc in Computer Engineering","relsharafa@hbku.edu.qa","Palestinian Territory, Occupie","974-70997711",null,null,29899900257]
[29981800536,210007477,"Mahmoud","Mohamed","ELraei",201820,201810,"Active","Science & Engineering","Undergraduate","Bachelor of Science"," ",null," ","Computer Engineering","BSc in Computer Engineering","melraei@hbku.edu.qa","Egypt","00974-66582926",null,null,29981800536]
[null,210004890,"Tala","Basem","Anabtawi",201820,201710,"Active","Science & Engineering","Undergraduate","Bachelor of Science"," ",null," ","Computer Engineering","BSc in Computer Engineering","tanabtawi@hbku.edu.qa","United States",{"$f":"974-77095894","v":-77094920}]
[29863401677,210004028,"Mohamed","Ahmed","Al-horr",201820,201610,"Active","Science & Engineering","Undergraduate","Bachelor of Science"," ",null," ","Computer Engineering","BSc in Computer Engineering","MOHALHORR@hbku.edu.qa","Qatar",{"$nulls":3},29863401677]
[30081800701,210007753,"Shorok",null,"Ayman",201820,201810,"Active","Science & Engineering","Undergraduate","Bachelor of Science"," ",null," ","Computer Engineering","BSc in Computer Engineering","saghonim@hbku.edu.qa","Egypt","974-55819823",null,null,30081800701]
[29581802527,210005311,"Omar","Elwalid","Elshal",201820,201710,"Active","Science & Engineering","Undergraduate","Bachelor of Science"," ",null," ","Computer Engineering","BSc in Computer Engineering","oelshal@hbku.edu.qa","Egypt","00974-33414517",null,null,29581802527]
[null,210007479,"Ghassan","Marwan","Saad",201820,201810,"Active","Science & Engineering","Undergraduate","Bachelor of Science"," ",null," ","Computer Engineering","BSc in Computer Engineering","gsaad@hbku.edu.qa","Palestinian Territory, Occupie","00961-70659402"]
[null,210005246,"Mohamed",null,"Amara",201820,201710,"Active","Science & Engineering","Undergraduate","Bachelor of Science"," ",null," ","Computer Engineering","BSc in Computer Engineering","mamara@hbku.edu.qa","Tunisia","974-66650902"]
[29805000160,210005821,"Zinia","Jaha","Jalal",201820,201810,"Active","Science & Engineering","Undergraduate","Bachelor of Science"," ",null," ","Computer Engineering","BSc in Computer Engineering","zjalal@hbku.edu.qa","Bangladesh","00974-77232744",null,null,29805000160]
[29163403713,210005479,"Mohammad","Ahmad","Al-Sooj",201820,201710,"Active","Science & Engineering","Undergraduate","Bachelor of Science"," ",null," ","Computer Engineering","BSc in Computer Engineering","malsooj@hbku.edu.qa","Qatar",-77000044,null,null,29163403713]
[29735601200,210004030,"Safiya",null,"Jan",201820,201610,"Active","Science & Engineering","Undergraduate","Bachelor of Science"," ",null," ","Computer Engineering","BSc in Computer Engineering","SAFKHAN@hbku.edu.qa","India","974-33652356",null,null,29735601200]
[null,210007478,"Moza","Hamad","Alkaabi",201820,201810,"Active","Science & Engineering","Undergraduate","Bachelor of Science"," ",null," ","Computer Engineering","BSc in Computer Engineering","mhalkaabi@hbku.edu.qa","Qatar","00974-55355622"]
{"$rows_left_out":240}
{"sheet":"Stipend Pmt Nov-19 ","index":5,"n_rows":35,"n_cols":15,"rows_kept":35}
[]
[{"$nulls":4},"Stipend Payment for Month/ YEAR"]
[]
[]
[]
["Ref."]
["To:   Accounts Payable Manager / QF-Finance"]
["CC:   Executive Director / QF-Finance"]
["CC:  Chief Financial Officer / HBKU-Finance"]
["Date: "]
[]
["Please arrange for the payment of QRXXXX/- stipend to the following students receiving scholarships via bank transfer to their respective below bank accounts. The HBKU account to be charged is HU.BW.85A.724009.S0XX.HBKU.0000.00"]
[]
["#","QID Student Name ","Banner Student Name","Banner ID","Qatar ID","Admit Semester","Program","Amount","IBAN ","Bank Name","Swift Code","Status Check","Further Notes","OS Fees","Tui/Housing"]
[1,{"$nulls":12},{"$f":"IFERROR(VLOOKUP(Table434[[#This Row],[Banner ID]],'[1]31072019 Ageing'!$D$29:$E$244,2,FALSE),0)","v":0},{"$f":"IFERROR(VLOOKUP(Table434[[#This Row],[Banner ID]],'[1]31072019 Ageing'!$D$29:$L$244,9,FALSE),0)","v":0}]
[{"$nulls":13},{"$f":"IFERROR(VLOOKUP(Table434[[#This Row],[Banner ID]],'[1]31072019 Ageing'!$D$29:$E$244,2,FALSE),0)","v":0},{"$f":"IFERROR(VLOOKUP(Table434[[#This Row],[Banner ID]],'[1]31072019 Ageing'!$D$29:$L$244,9,FALSE),0)","v":0}]
[{"$nulls":13},{"$f":"IFERROR(VLOOKUP(Table434[[#This Row],[Banner ID]],'[1]31072019 Ageing'!$D$29:$E$244,2,FALSE),0)","v":0},{"$f":"IFERROR(VLOOKUP(Table434[[#This Row],[Banner ID]],'[1]31072019 Ageing'!$D$29:$L$244,9,FALSE),0)","v":0}]
[{"$nulls":13},{"$f":"IFERROR(VLOOKUP(Table434[[#This Row],[Banner ID]],'[1]31072019 Ageing'!$D$29:$E$244,2,FALSE),0)","v":0},{"$f":"IFERROR(VLOOKUP(Table434[[#This Row],[Banner ID]],'[1]31072019 Ageing'!$D$29:$L$244,9,FALSE),0)","v":0}]
[{"$nulls":13},{"$f":"IFERROR(VLOOKUP(Table434[[#This Row],[Banner ID]],'[1]31072019 Ageing'!$D$29:$E$244,2,FALSE),0)","v":0},{"$f":"IFERROR(VLOOKUP(Table434[[#This Row],[Banner ID]],'[1]31072019 Ageing'!$D$29:$L$244,9,FALSE),0)","v":0}]
[{"$nulls":13},{"$f":"IFERROR(VLOOKUP(Table434[[#This Row],[Banner ID]],'[1]31072019 Ageing'!$D$29:$E$244,2,FALSE),0)","v":0},{"$f":"IFERROR(VLOOKUP(Table434[[#This Row],[Banner ID]],'[1]31072019 Ageing'!$D$29:$L$244,9,FALSE),0)","v":0}]
{"$rows_left_out":15}