{"text_format":"3","workbook":"xlsx","n_sheets":2,"sheets":["ANU WHS L&OR MATRIX","Drop Down Lists"],"not_rendered":{"images":1,"defined_names":9},"read":"whole","date_system":"1900"}

{"sheet":"ANU WHS L&OR MATRIX","index":0,"n_rows":95,"n_cols":130,"rows_kept":95,"merged":[[8,5,8,20],[8,21,8,29],[8,30,8,55],[8,56,8,122],[8,123,8,129],[9,0,10,0],[9,1,10,1],[9,2,10,2],[9,3,10,3],[9,4,10,4],[9,5,10,5],[9,6,10,6],[9,7,10,7],[9,8,10,8],[9,9,10,9],[9,10,10,10],[9,11,10,11],[9,12,10,12],[9,13,10,13],[9,14,10,14],[9,15,10,15],[9,16,10,16],[9,17,10,17],[9,18,10,18],[9,19,10,19],[9,20,10,20],[9,21,10,21],[9,22,10,22],[9,23,10,23],[9,24,10,24],[9,25,10,25],[9,26,10,26],[9,27,10,27],[9,28,10,28],[9,29,10,29],[9,30,10,30],[9,31,10,31],[9,32,10,32],[9,33,10,33],[9,34,10,34],[9,35,10,35],[9,36,10,36],[9,37,10,37],[9,38,10,38],[9,39,10,39],[9,40,10,40],[9,41,10,41],[9,42,10,42],[9,43,10,43],[9,44,10,44],[9,45,10,45],[9,46,10,46],[9,47,10,47],[9,48,10,48],[9,49,10,49],[9,50,10,50],[9,51,10,51],[9,52,10,52],[9,53,10,53],[9,54,10,54],[9,55,10,55],[9,56,10,56],[9,57,10,57],[9,58,10,58],[9,59,10,59],[9,60,10,60],[9,61,10,61],[9,62,10,62],[9,63,10,63],[9,64,10,64],[9,65,10,65],[9,66,10,66],[9,67,10,67],[9,68,10,68],[9,69,10,69],[9,70,10,70],[9,71,10,71],[9,72,10,72],[9,73,10,73],[9,74,10,74],[9,75,10,75],[9,76,10,76],[9,77,10,77],[9,78,10,78],[9,79,10,79],[9,80,10,80],[9,81,10,81],[9,82,10,82],[9,83,10,83],[9,84,10,84],[9,85,10,85],[9,86,10,86],[9,87,10,87],[9,88,10,88],[9,89,10,89],[9,90,10,90],[9,91,10,91],[9,92,10,92],[9,93,10,93],[9,94,10,94],[9,95,10,95],[9,96,10,96],[9,97,10,97],[9,98,10,98],[9,99,10,99],[9,100,10,100],[9,101,10,101],[9,102,10,102],[9,103,10,103],[9,104,10,104],[9,105,10,105],[9,106,10,106],[9,107,10,107],[9,108,10,108],[9,109,10,109],[9,110,10,110],[9,111,10,111],[9,112,10,112],[9,113,10,113],[9,114,10,114],[9,115,10,115],[9,116,10,116],[9,117,10,117],[9,118,10,118],[9,119,10,119],[9,120,10,120],[9,121,10,121],[9,122,10,122],[9,123,10,123],[9,124,10,124],[9,125,10,125],[9,126,10,126],[9,127,10,127],[9,128,10,128],[9,129,10,129]]}
{"$rows_empty":8}
[{"$nulls":5},"Acts",{"$nulls":15},"Regulations",{"$nulls":8},"Codes of Practice",{"$nulls":25},"Australian Standards",{"$nulls":66},"Other"]
["Documents","Document ID","V#","Next Review Due","Hazard Profile","Work Health and Safety Act 2011 (Clth)","Australian Radiation Protection and Nuclear Safety Act 1998 (Cth)","Australian National Territory (Planning and Land Management) Act 1988","Agricultural and Veterinary Chemicals (Administration) Act 1992","Agricultural and Veterinary Chemicals Code Act 1994 (Cth)","BioSecurity Act 2015 (Cth)","Customs Act 1901 (Cth)","Chemical Weapons (Prohibition) Act 1994 (Cth)","Dangerous Goods (Road Transport) Act 2009 (ACT)","Environment Protection Act 1997","Excise Act 1901 (Cth)","Explosives Act 1961 (Cth)","Firearms Act 1996 (ACT)","Gene Technology Act 2000 (Cth)","Medicines, Poisons and Therapeutic Goods Act 2008 (ACT)","Therapeutic Good Act (1989) Therapeutic Goods Administation (TGA)","Work Health and Safety Regulations 2011 (Cth)","Agricultural and Veterinary Chemicals Code Regulations 1995 (Cth)","Australian Radiation Protection and Nuclear Safety Regulations 2018 (Cth)","Biosecurity Regulations 2016 (Cth)","Chemical Weapons (Prohibition) Regulations 1997 (Cth)","Dangerous Goods (Road Transport) Regulation 2010 9 (ACT)","Firearms Regulation 2018 (ACT)","Gene Technology Regulations 2011 (Cth)","Excise Regulations 2015 (Cth)","Work Health and Safety (Abrasive Blasting) Code of Practice 2015","Work Health and Safety (Construction Work) Code of Practice 2015","Work Health and Safety (Confined Spaces) Code of Practice 2015","Work Health and Safety (Demolition Work) Code of Practice 2015","Work Health and Safety (First Aid in the Workplace) Code of Practice 2015","Work Health and Safety (Excavation Work) Code of Practice 2015","Work Health and Safety (Labelling of Workplace Hazardous Chemicals) Code of Practice 2015","Work Health and Safety (Managing Electrical Risks in the Workplace) Code of Practice 2015","Work Health and Safety (Managing Noise and Preventing Hearing Loss at Work) Code of Practice 2015","Work Health and Safety (Managing the Risk of Falls at Workplaces) Code of Practice 2015","Work Health and Safety (Managing Risks of Plant in the Workplace) Code of Practice 2015","Work Health and Safety (Managing Risks of Hazardous Chemicals in the Workplace) Code of Practice 2015","Work Health and Safety (Managing the Work Environment and Facilities) Code of Practice 2015","Work Health and Safety (Hazardous Manual Tasks) Code of Practice 2015","Work Health and Safety (How to Manage and Control Asbestos in the Workplace) Code of Practice 2015","Work Health and Safety (How to Manage Work Health and Safety Risks) Code of Practice 2015","Work Health and Safety (How to Safely Remove Asbestos) Code of Practice 2015","Work Health and Safety (Preparation of Safety Data Sheets for Hazardous Chemicals) Code of Practice 2015","Work Health and Safety (Safe Design of Structures) Code of Practice 2015","Work Health and Safety (Spray Painting and Powder Coating) Code of Practice 2015","Work Health and Safety (Work Health and Safety Consultation, Co-operation and Co-ordination) Code of Practice 2015","Work Health and Safety (Welding Processes) Code of Practice 2015","Australian Dangerous Goods Code","The National Code of Practice for Chemicals of Security Concern","ARANSA - Radiation Protections Series","ARPANSA - Radiation Health Series","AS/NZS ISO 19011: Guidelines for auditing management systems","AS/NZS 1200 Pressure Equipment","AS/NZS 1228  Pressure Equipment: Boilers","AS/NZS 1269.1 Occupational Noise management - Measurement and assessment of noise immission and exposure","AS/NZS 1269.3 Occupational Noise management - Hearing Protection Program","AS/NZS 1269.4  Occupational Noise management - Audiomety assessment","AS/NZS 1270 Hearing Protectors","AS 1319 Safety Signs for the occupational environment","AS/NZS 1336 Eye and face protection -Guidelines","AS/NZS 1337 Personal eye protection","AS/NZS 1337 Part 4 & 5 Requirements for eye protectors against laser radiation","AS/NZS 1418 Cranes Hoist and  Winches Series","AS/NZS 1576.1 Scaffolding - General Requirements","AS 1596 The storage and handling of LP Gas","AS/NZS 1657 Fixed platforms, walkways, stairways and ladders - design, construction and installation","AS/NZS 1680.1 Interior Workplace Lighting","AS/NZS 1715 Selection, use and maintenance of respiratory protection devices","AS/NZS 1716 Respiratory protective devices","AS/NZS 1800 Occupational protective helmets - selection, care and use","AS/NZS 1891 Industrial Fall-Arrest Systems and Devices Series","AS/NZS 1892 Portable Ladders Series","AS 1894 The storage and  handling of non-flammable cryogenic and refrigerated liquids","AS 1940 The storage and handling of flammable and combustible liquids","AS 2030 Series: Gas Cylinders","AS/NZS 2161.2 Occupational prtectove gloves - general requirements","AS/NZS 2210.1 Occupational protective footwear - Guide to selection, care and use","AS/NZS 2243.1 Safety in Laboratories (Planning and Operations Aspects)","AS/NZS 2243.2 Safety in Laboratories (Chemical Aspects)","AS/NZS 2243.3 Safety in Laboratories (Microbiological Safety and Containment)","AS/NZS 2243.4 Safety in Laboratories (Ionizing Radiation)","AS/NZS 2243.5 Safety in Laboratories (Non-ionizing radiations - Electromagnetic, sound and unltrasound)","AS/NZS 2243.6 Safety in Laboratories (Plant and Equipment Aspects)","AS 2243.7 Safety in Laboratories (Electrical Aspects)","AS/NZS 2243.8 Safety in Laboratories (Fume Cupboards)","AS/NZS 2243.9 Safety in Laboratories (Recirculating Fume Cabinets)","AS/NZS 2243.10 Safety in Laboratories (Storage of Chemicals)","AS 2293.1 Emergency escape lighting and exit signs for buildings – System design, installation and operation","AS/NZS 2293.2 Emergency lighting and exit signs for buildings, Part 2: Routine service and maintenance","AS 2293.3 Emergency escape lighting and exit signs for buildings – Emergency escape luminaires and exit signs","AS 2342 Development, testing and implementation of information and safety symbols and symbolic signs","AS/NZS 2359.2 Powered industrial trucks - Operations","AS/NZS 2550 Crane Safe Use Series","AS 2865 Confined Spaces","AS/NZS 2971  Serially produced pressure vessels","AS/NZS 2982:2010 Laboratory Design and Construction","AS/NZS 3105 Approval and test specification - Electrical portable outlet devices","AS/NZS 3760 In-service safety inspection and testing of electrical equipment","AS 3780 The storage and handling of corrosive substances","AS/NZS 3788 Pressure equipment – In-service inspection","AS 4024.1 Series Safety of Machinery","AS/NZS 4024.1601 Design of controls, interlocks and guarding - Guards - General requirements for the design and construction of fixed and movable guards","AS/NZS 4114 Spray painting booths, designated spray paining areas and paint mixing rooms","AS/NZS 4142.3 Man-made Fibre Rope for Static Life Rescue Lines","AS 4332 The storage and handling of gases in cylinders","AS/NZS 4343 Pressure equipment – hazard levels","AS/NZS 4386 Safe working on or near low-voltage electrical installations and equipment","AS/NZS 4452 The storage and handling  of toxic substances","AS/NZS 4488.2 Industrial rope access systems - Selection, use and maintenance","AS/NZS 4576 Guidelines for Scaffolding","AS 4603 Flashback Arresters - Safety devices for use with fuel gases and oxygen or compressed air","AS 4775 Emergency eyewash and shower equipment","AS/NZS 4994 Series: Temporary edge protection","AS 61010.1 Safety Requirements for electrical  equipment for measurement, control and laboratory use ","AS/NZS IEC 60825.1 Safety of laser products, Part 1: Equipment classification and requirements","AS/NZS IEC 60825.14 Safety of laser products, part 14: A User’s guide","AS/NZS 61439.4 Low-voltage switchgear and controlgear assemblies - Particular requirements for assemblies for construction sites (ACS)","AS/ NZS IEC 62471- Photo biological Safety of Lamps and Lamp System","Administrative Functions Disposal Authority National Archives of Australia","Ansell Chemical Resistance Guide for Gloves","Comcare Guide for Applicants WHS014 — Plant registration","National Self-Insurer WHS Audit Tool","National Construction Code of Australia","Hazardous Chemical Information System (HCIS)","Workplace exposure standards for airborne contaminants Safework Australia"]
[]
["Policy: Work Health and Safety","ANUP_000432",6,"2022-06-13","NA","X",{"$nulls":15},"X",{"$nulls":104},"X"]
["Policy: Chemical Management","ANUP_000384",4,"2021-02-19","Chemical","X",{"$nulls":15},"X",{"$nulls":104},"X"]
["Policy: Radiation Safety ","ANUP_001232",7,"2022-09-02","Radiation","X","X",{"$nulls":14},"X",null,"X"]
["Procedure: Work health and Safety Actions","ANUP_015810",5,"2021-06-15","NA","X",{"$nulls":15},"X",{"$nulls":104},"X"]
["Procedure: Work Health and Safety Audit","ANUP_015807",3,"2020-07-01","NA","X",{"$nulls":15},"X",{"$nulls":34},"X",{"$nulls":69},"X"]
["Procedure: Work Health and Safety Committees and Reprentatives","ANUP_015808",2,"2020-07-01","NA","X",{"$nulls":15},"X",{"$nulls":104},"X"]
["Procedure: Work Health and Safety Communication and Consultation","ANUP_015809",2,"2020-07-01","NA","X",{"$nulls":15},"X",{"$nulls":28},"X",{"$nulls":75},"X"]
["Procedure: Work Health and Safety Documentation Management","ANUP_015811",2,"2020-07-01","NA","X",{"$nulls":15},"X",{"$nulls":101},"X",null,null,"X"]
["Procedure: Work Health and Safety Hazard Management","ANUP_015812",3,"2020-07-01","NA","X",{"$nulls":15},"X",{"$nulls":23},"X",{"$nulls":80},"X"]
["Procedure: Work Health and Safety Incident Management","ANUP_015813",2,"2020-07-01","NA","X",{"$nulls":15},"X",{"$nulls":104},"X"]
["Procedure: Work Health and Safety Legal and Other Requirements","ANUP_015814",2,"2020-07-01","NA","X",{"$nulls":15},"X",{"$nulls":104},"X"]
["Procedure: Work Health and Safety Management Review","ANUP_015815",2,"2020-07-01","NA","X",{"$nulls":15},"X",{"$nulls":104},"X"]
["Procedure: Work Health and Safety Monitoring and Testing","ANUP_015816",4,"2021-06-15","NA","X",{"$nulls":15},"X",{"$nulls":18},"X","X","X",{"$nulls":83},"X"]
["Procedure: Work Health and Safety Planning, Objectives, Targets and Programs","ANUP_015818",2,"2021-06-15","NA","X",{"$nulls":15},"X",{"$nulls":104},"X"]
["Procedure: Work Health and Safety Reporting","ANUP_015819",3,"2021-06-15","NA","X",{"$nulls":15},"X",{"$nulls":104},"X"]
["Procedure: Work Health and Safety Responsibilities","ANUP_015820",2,"2020-07-01","NA","X",{"$nulls":15},"X",{"$nulls":104},"X"]
["Procedure: Work Health and Safety Training","ANUP_015821",2,"2020-07-01","NA","X",{"$nulls":15},"X",{"$nulls":104},"X"]
["Procedure: Abrasive Blasting ","ANUP_018009",2,"2021-05-14","Chemical","X",{"$nulls":15},"X",{"$nulls":8},"X",{"$nulls":10},"X",{"$nulls":3},"X",{"$nulls":83},"X"]
["Procedure: Biological Safety ","ANUP_018026",2,"2021-06-28","Biological","X",{"$nulls":4},"X",{"$nulls":7},"X",null,null,"X",null,null,"X",{"$nulls":3},"X",{"$nulls":16},"X",{"$nulls":38},"X"]
["Procedure: Chemical management","ANUP_000636",6,"2021-09-28","Chemical","X","X",null,null,"X",null,"X","X","X",null,"X","X",null,null,"X","X","X","X","X",null,"X",{"$nulls":3},"X",{"$nulls":6},"X",{"$nulls":4},"X",{"$nulls":3},"X",null,"X",{"$nulls":4},"X","X",{"$nulls":23},"X","X",{"$nulls":4},"X",{"$nulls":19},"X",{"$nulls":8},"X",{"$nulls":13},"X",null,"X","X"]
["Procedure: Compressed Gas Cylinder Safety","ANUP_017610",3,"2021-02-19","Chemical","X",{"$nulls":7},"X",{"$nulls":7},"X",{"$nulls":4},"X",{"$nulls":9},"X",{"$nulls":4},"X",{"$nulls":3},"X",{"$nulls":6},"X",{"$nulls":16},"X",{"$nulls":9},"X",{"$nulls":23},"X",{"$nulls":5},"X",null,null,"X",null,null,"X"]
["Procedure: Contractor Work Health and Safety ","ANUP_017807",2,"2021-04-23","Contractor","X",{"$nulls":15},"X",{"$nulls":9},"X",null,"X",null,"X",{"$nulls":10},"X",null,"X",{"$nulls":77},"X"]
["Procedure: Control of Access to Restricted Locations","ANUP_000582",5,"2019-11-16","Facility","X",{"$nulls":15},"X",{"$nulls":104},"X"]
["Procedure: Confined Space Safety ","ANUP_000588",13,"2021-05-14","Facility","X",{"$nulls":15},"X",{"$nulls":10},"X",{"$nulls":65},"X",{"$nulls":27},"X"]
["Procedure: Emergency Response","ANUP_000699",17,"2019-10-31","Emergency","X",{"$nulls":15},"X",{"$nulls":104},"X"]
["Procedure: Electrical Safety Management","ANUP_000572",12,"2021-04-20","Electrical","X",{"$nulls":15},"X",{"$nulls":9},"X",{"$nulls":3},"X",null,"X",{"$nulls":64},"X",{"$nulls":8},"X",{"$nulls":6},"X"]
["Procedure: Excavation anf Surface Penetration","ANUP_018010",2,"2021-05-14","Construction","X",null,"X",{"$nulls":13},"X"]
["Procedure: Fall Prevention","ANUP_000700",13,"2021-05-14","Height","X",{"$nulls":15},"X",{"$nulls":17},"X",{"$nulls":27},"X","X",null,"X",{"$nulls":4},"X","X",{"$nulls":19},"X",{"$nulls":11},"X",{"$nulls":4},"X","X",null,null,"X"]
["Procedure: Firearm Safety Management","ANUP_018014",2,"2021-05-21","Firearm","X",{"$nulls":11},"X",{"$nulls":3},"X",{"$nulls":5},"X"]
["Procedure: Fixed Plant and Equipment - Machine Guarding ","ANUP_018020",1,"2021-05-28","Plant","X",{"$nulls":15},"X",{"$nulls":18},"X",{"$nulls":64},"X","X"]
["Procedure: Hand and Power Tool Safety","ANUP_018019",3,"2021-05-24","Plant","X",{"$nulls":15},"X",{"$nulls":21},"X",{"$nulls":57},"X",{"$nulls":19},"X"]
["Procedure: Health Monitoring","ANUP_000504",8,"2021-07-25","Chemical, Noise","X",{"$nulls":15},"X",{"$nulls":104},"X"]
["Procedure: Immunisation","ANUP_000503",9,"2021-06-08","Biological","X",{"$nulls":15},"X"]
["Procedure: Isolation and Danger Tagging ","ANUP_000571",8,"2021-04-20","Electrical, Plant","X",{"$nulls":15},"X",{"$nulls":18},"X",{"$nulls":64},"X",{"$nulls":5},"X"]
["Procedure: Laboratory Safety","ANUP_018023",3,"2021-06-25","Laboratory","X",{"$nulls":15},"X",{"$nulls":60},"X","X","X","X","X","X","X","X","X","X",{"$nulls":8},"X"]
["Procedure: Licensing of High Risk Work ","ANUP_018012",3,"2021-05-14","Licence","X",{"$nulls":15},"X",{"$nulls":104},"X"]
["Procedure: Noise Management","ANUP_000581",8,"2019-12-09","Noise","X",{"$nulls":15},"X",{"$nulls":16},"X",{"$nulls":20},"X","X","X","X"]
["Procedure: Nuclear Safety","ANUP_000761",6,"2019-09-09","Radiation","X","X",{"$nulls":16},"X"]
["Procedure: Painting Management","ANUP_000577",10,"2019-11-23","Chemical","X",{"$nulls":15},"X",{"$nulls":27},"X",{"$nulls":57},"X"]
["Procedure: Permit to Work","ANUP_018011",1,"2021-05-14","NA","X",{"$nulls":15},"X",{"$nulls":104},"X"]
["Procedure: Personal Protective Equipment","ANUP_000629",4,"2021-05-21","NA","X",{"$nulls":15},"X",{"$nulls":42},"X","X",{"$nulls":6},"X","X","X",{"$nulls":5},"X","X",{"$nulls":42},"X",null,"X"]
["Procedure: Pest Management","ANUP_000591",9,"2019-11-17","Chemical","X",null,null,"X","X",{"$nulls":4},"X",{"$nulls":4},"X",null,"X","X"]
["Procedure: Plant and Equipment Safety Management","ANUP_000569",15,"2021-04-20","Plant","X",{"$nulls":15},"X",{"$nulls":18},"X",{"$nulls":85},"X"]
["Procedure: Pressure Equipment Safety","ANUP_018015",3,"2021-05-21","Plant","X",{"$nulls":15},"X",{"$nulls":18},"X",{"$nulls":16},"X","X",{"$nulls":40},"X",{"$nulls":4},"X",{"$nulls":5},"X",{"$nulls":14},"X"]
["Procedure: Provision of First Aid Services"," ANUP_000530",8,"2021-06-27","First Aid","X",{"$nulls":15},"X",{"$nulls":12},"X",{"$nulls":28},"X",{"$nulls":52},"X"]
["Procedure: Raditation Safety","ANUP_000682",13,"2021-06-25","Radiation","X","X",{"$nulls":14},"X",null,"X - Comment 21/11/2019 ARPANS Regulations 2018 has been amended a) The ARPANSA Codes and Standards referenced in the ARPANS Regulations now refer to the year of publication. Action: University Procedure to be updated with year rather than letters. b) The safety analysis report should be reviewed at least once every three years. This applies to radiation facilities. Action: Include a section in WHSMS Chapter 3.9 Radiation Safety Management on this requirement.",{"$nulls":30},"X","X",{"$nulls":8},"X",null,"X",{"$nulls":15},"X",null,null,"X","X",{"$nulls":13},"X",{"$nulls":18},"X","X",null,"X"]
["Procedure: Safe Management of Asbestos and Synthetic Mineral Fibres","ANUP_018027",2,"2021-06-28","Chemical","X",{"$nulls":15},"X",{"$nulls":22},"X",null,"X",{"$nulls":16},"X"]
["Procedure: Safety Signange","ANUP_018013",2,"2021-05-21","NA","X",{"$nulls":15},"X",{"$nulls":73},"X",{"$nulls":30},"X"]
["Procedure: Working Safely Away from Campus","ANUP_000531",12,"2021-07-12","Off Campus","X",{"$nulls":15},"X",{"$nulls":104},"X"]
["WHSMS Handbook Chapter 2.1 University WHS Planning","NA",1,"2022-07-05","NA","X",{"$nulls":15},"X",{"$nulls":101},"X",null,null,"X"]
["WHSMS Handbook Chapter 2.2 Local WHS Plan","NA",1,"2022-07-05","NA","X",{"$nulls":15},"X",{"$nulls":101},"X",null,null,"X"]
["WHSMS Handbook Chapter 3.1 Hazard Management","NA",1,"2022-11-25","NA","X",{"$nulls":15},"X",{"$nulls":23},"X",{"$nulls":77},"X",null,null,"X"]
["WHSMS Handbook Chapter 3.2 WHS Inductions, Training and Supervision","NA",1,"2022-11-29","NA","X",{"$nulls":15},"X",{"$nulls":101},"X",null,null,"X"]
["WHSMS Handbook Chapter 3.3 WHS Local Training Plan","NA",1,"2022-11-25","NA","X",{"$nulls":15},"X",{"$nulls":101},"X",null,null,"X"]
["WHSMS Handbook Chapter 3.4 First Aid","NA",1,"2022-10-24","NA","X",{"$nulls":15},"X",{"$nulls":12},"X",{"$nulls":28},"X",{"$nulls":52},"X",{"$nulls":6},"X",null,null,"X"]
["WHSMS Handbook Chapter 3.5 Emergency Safety Management ","NA",null,"Not ready"]
{"$rows_left_out":29}
{"sheet":"Drop Down Lists","index":1,"n_rows":250,"n_cols":7,"rows_kept":250,"hidden":true}
[]
["Standard","Document","Type","Risk Category","Responsibilities","Location ","File Type"]
[0,{"$f":"IF(#REF!=\"\",\"\",#REF!)","v":{"$error":"#REF!"}},"Procedure",1,"CEO","HSE Resource Database","Word"]
["01",{"$f":"IF(#REF!=\"\",\"\",#REF!)","v":{"$error":"#REF!"}},"Form",2,"P&P Director","Safety Drive/Group Folder","Excel"]
["02",{"$f":"IF(#REF!=\"\",\"\",#REF!)","v":{"$error":"#REF!"}},"Standard",3,"Group HSE Manager","LearnTrac","Pdf "]
["03",{"$f":"IF(#REF!=\"\",\"\",#REF!)","v":{"$error":"#REF!"}},"Register",4,"Group HSE Auditor",null,"PowerPoint"]
["04",{"$f":"IF(#REF!=\"\",\"\",#REF!)","v":{"$error":"#REF!"}},"Plan",null,"Group E Manager"]
["05",{"$f":"IF(#REF!=\"\",\"\",#REF!)","v":{"$error":"#REF!"}},"Policy",null,"Group WC Manager"]
["06",{"$f":"IF(#REF!=\"\",\"\",#REF!)","v":{"$error":"#REF!"}},"SOP"]
["07",{"$f":"IF(#REF!=\"\",\"\",#REF!)","v":{"$error":"#REF!"}},"WI"]
["08",{"$f":"IF(#REF!=\"\",\"\",#REF!)","v":{"$error":"#REF!"}},"Map"]
["09",{"$f":"IF(#REF!=\"\",\"\",#REF!)","v":{"$error":"#REF!"}},"Guide"]
["10",{"$f":"IF(#REF!=\"\",\"\",#REF!)","v":{"$error":"#REF!"}},"Database"]
["11",{"$f":"IF(#REF!=\"\",\"\",#REF!)","v":{"$error":"#REF!"}}]
["12",{"$f":"IF(#REF!=\"\",\"\",#REF!)","v":{"$error":"#REF!"}}]
["13",{"$f":"IF(#REF!=\"\",\"\",#REF!)","v":{"$error":"#REF!"}}]
["14",{"$f":"IF(#REF!=\"\",\"\",#REF!)","v":{"$error":"#REF!"}}]
["15",{"$f":"IF(#REF!=\"\",\"\",#REF!)","v":{"$error":"#REF!"}}]
["16",{"$f":"IF(#REF!=\"\",\"\",#REF!)","v":{"$error":"#REF!"}}]
["17",{"$f":"IF(#REF!=\"\",\"\",#REF!)","v":{"$error":"#REF!"}}]
["18",{"$f":"IF(#REF!=\"\",\"\",#REF!)","v":{"$error":"#REF!"}}]
[19,{"$f":"IF(#REF!=\"\",\"\",#REF!)","v":{"$error":"#REF!"}}]
[null,{"$f":"IF(#REF!=\"\",\"\",#REF!)","v":{"$error":"#REF!"}}]
[null,{"$f":"IF(#REF!=\"\",\"\",#REF!)","v":{"$error":"#REF!"}}]
[null,{"$f":"IF(#REF!=\"\",\"\",#REF!)","v":{"$error":"#REF!"}}]
[null,{"$f":"IF(#REF!=\"\",\"\",#REF!)","v":{"$error":"#REF!"}}]
[null,{"$f":"IF(#REF!=\"\",\"\",#REF!)","v":{"$error":"#REF!"}}]
[null,{"$f":"IF(#REF!=\"\",\"\",#REF!)","v":{"$error":"#REF!"}}]
[null,{"$f":"IF(#REF!=\"\",\"\",#REF!)","v":{"$error":"#REF!"}}]
[null,{"$f":"IF(#REF!=\"\",\"\",#REF!)","v":{"$error":"#REF!"}}]
[null,{"$f":"IF(#REF!=\"\",\"\",#REF!)","v":{"$error":"#REF!"}}]
[null,{"$f":"IF(#REF!=\"\",\"\",#REF!)","v":{"$error":"#REF!"}}]
[null,{"$f":"IF(#REF!=\"\",\"\",#REF!)","v":{"$error":"#REF!"}}]
[null,{"$f":"IF(#REF!=\"\",\"\",#REF!)","v":{"$error":"#REF!"}}]
[null,{"$f":"IF(#REF!=\"\",\"\",#REF!)","v":{"$error":"#REF!"}}]
[null,{"$f":"IF(#REF!=\"\",\"\",#REF!)","v":{"$error":"#REF!"}}]
[null,{"$f":"IF(#REF!=\"\",\"\",#REF!)","v":{"$error":"#REF!"}}]
[null,{"$f":"IF(#REF!=\"\",\"\",#REF!)","v":{"$error":"#REF!"}}]
[null,{"$f":"IF(#REF!=\"\",\"\",#REF!)","v":{"$error":"#REF!"}}]
[null,{"$f":"IF(#REF!=\"\",\"\",#REF!)","v":{"$error":"#REF!"}}]
[null,{"$f":"IF(#REF!=\"\",\"\",#REF!)","v":{"$error":"#REF!"}}]
[null,{"$f":"IF(#REF!=\"\",\"\",#REF!)","v":{"$error":"#REF!"}}]
[null,{"$f":"IF(#REF!=\"\",\"\",#REF!)","v":{"$error":"#REF!"}}]
[null,{"$f":"IF(#REF!=\"\",\"\",#REF!)","v":{"$error":"#REF!"}}]
[null,{"$f":"IF(#REF!=\"\",\"\",#REF!)","v":{"$error":"#REF!"}}]
[null,{"$f":"IF(#REF!=\"\",\"\",#REF!)","v":{"$error":"#REF!"}}]
[null,{"$f":"IF(#REF!=\"\",\"\",#REF!)","v":{"$error":"#REF!"}}]
[null,{"$f":"IF(#REF!=\"\",\"\",#REF!)","v":{"$error":"#REF!"}}]
[null,{"$f":"IF(#REF!=\"\",\"\",#REF!)","v":{"$error":"#REF!"}}]
[null,{"$f":"IF(#REF!=\"\",\"\",#REF!)","v":{"$error":"#REF!"}}]
[null,{"$f":"IF(#REF!=\"\",\"\",#REF!)","v":{"$error":"#REF!"}}]
[null,{"$f":"IF(#REF!=\"\",\"\",#REF!)","v":{"$error":"#REF!"}}]
[null,{"$f":"IF(#REF!=\"\",\"\",#REF!)","v":{"$error":"#REF!"}}]
[null,{"$f":"IF(#REF!=\"\",\"\",#REF!)","v":{"$error":"#REF!"}}]
[null,{"$f":"IF(#REF!=\"\",\"\",#REF!)","v":{"$error":"#REF!"}}]
[null,{"$f":"IF(#REF!=\"\",\"\",#REF!)","v":{"$error":"#REF!"}}]
[null,{"$f":"IF(#REF!=\"\",\"\",#REF!)","v":{"$error":"#REF!"}}]
[null,{"$f":"IF(#REF!=\"\",\"\",#REF!)","v":{"$error":"#REF!"}}]
[null,{"$f":"IF(#REF!=\"\",\"\",#REF!)","v":{"$error":"#REF!"}}]
[null,{"$f":"IF(#REF!=\"\",\"\",#REF!)","v":{"$error":"#REF!"}}]
{"$rows_left_out":190}