{"text_format":"3","workbook":"xlsx","n_sheets":5,"sheets":["PlanOfStudy","Courses","Computations","Instructions","VersionInfo"],"not_rendered":{"defined_names":1},"read":"whole","date_system":"1900"}

{"sheet":"PlanOfStudy","index":0,"n_rows":53,"n_cols":6,"rows_kept":53,"merged":[[30,2,30,5],[31,2,31,5],[32,2,32,5],[33,2,33,5],[34,2,34,5],[35,2,35,5],[36,2,36,5],[38,1,41,4],[43,0,43,3],[44,0,44,3],[45,0,45,3],[48,0,48,3],[49,0,49,3],[50,0,50,3]]}
["NAME:"]
["HUID#:"]
["Current Year:"]
["This Plan of Study is to:"]
["Use these abbreviations: CS, Math, Phys, ES, AM. Stat, Econ. Be sure to include the “r” in courses like CS91r "]
[]
["Which program? (Choose from menu)",null,"Basic"]
[{"$f":"IF($C$7=\"Joint\",\"With what other field?\",\"\")","v":""}]
[{"$f":"IF($C$7=\"Joint\",\"Is CS Primary or Allied? Choose from menu\",\"\")","v":""}]
["Enter grade from menu to calculate your GPA","Grade","Course","Term (will be) taken","Grading basis"]
{"$rows_left_out":44}
{"sheet":"Courses","index":1,"n_rows":1000,"n_cols":28,"rows_kept":1000,"hidden":true}
["CanonicalName","CanName+Semester","Name","Semester","Name2","Name3","FormerName","COURSE LONG TITLE","Public notes","corecs","programming1","programming2","formalreasoning","discretemath","complimitations","algorithms","intermediatealgorithms","systems","computationandtheworld","ai","advancedcs","probability","linearalgebra","Tags"]
[{"$f":"SUBSTITUTE(SUBSTITUTE(SUBSTITUTE(SUBSTITUTE(SUBSTITUTE(C2,\"APMTH\",\"AM\"),\"ENG-SCI\",\"ES\"),\"COMPSCI\",\"CS\"),\"  \",\"\"),\" \",\"\")","v":"AC215"},{"$f":"A2&\":\"&D2","v":"AC215:"},"AC215",{"$nulls":4},"Topics in Applied Computation: Advanced Practical Data Science, MLOps",null,"corecs",{"$nulls":10},"advancedcs",null,null,"corecs, advancedcs"]
[{"$f":"SUBSTITUTE(SUBSTITUTE(SUBSTITUTE(SUBSTITUTE(SUBSTITUTE(C3,\"APMTH\",\"AM\"),\"ENG-SCI\",\"ES\"),\"COMPSCI\",\"CS\"),\"  \",\"\"),\" \",\"\")","v":"AC221"},{"$f":"A3&\":\"&D3","v":"AC221:"},"AC221",{"$nulls":4},"Critical Thinking in Data Science",null,"corecs",{"$nulls":8},"computationandtheworld",{"$nulls":4},"corecs, computationandtheworld, secondary"]
["AC295","AC295:Fall 2021","AC295","Fall 2021","CS2871r",null,null,"Deep Learning for NLP",null,"corecs",{"$nulls":8},"computationandtheworld",null,"advancedcs",null,null,"corecs, computationandtheworld, advancedcs"]
["AM21A","AM21A:","AM21A",{"$nulls":4},"Mathematical Methods in the Sciences"]
["AM22A","AM22A:","AM22A",{"$nulls":4},"Solving and Optimizing",{"$nulls":14},"linearalgebra","linearalgebra"]
["AM22B","AM22B:","AM22B",{"$nulls":4},"Integrating and Approximating"]
["AM106","AM106:","AM106",{"$nulls":4},"Applied Algebra",null,"corecs",{"$nulls":13},"corecs"]
["AM107","AM107:","AM107",{"$nulls":4},"Graph Theory and Combinatorics",null,"corecs",null,null,"formalreasoning","discretemath",{"$nulls":6},"advancedcs",null,null,"corecs, formalreasoning, discretemath, advancedcs"]
["AM115","AM115:","AM115",{"$nulls":4},"Mathematical Modeling",null,"corecs",{"$nulls":8},"computationandtheworld",{"$nulls":4},"corecs, computationandtheworld"]
{"$rows_left_out":991}
{"sheet":"Computations","index":2,"n_rows":81,"n_cols":52,"rows_kept":81,"hidden":true,"merged":[[2,24,2,25]]}
["This sheet has a variety of computations on it."]
[{"$nulls":38},"Any unknown courses?",{"$f":"OR($V$6:$V$16)","v":false}]
[{"$nulls":24},"PassFail/SUS permitted?",null,true,false,false,false,false,false,false,false,false,false,true]
[{"$nulls":7},"Grade","Grade points",null,null,"Terms","Num value of term"]
["Program",{"$f":"PlanOfStudy!C7","v":"Basic"},{"$nulls":5},"A",{"v":4,"d":"4.000"},null,null,"Fall 2015",1,null,null,"Course canonical name","Spreadsheet Canonical Name","Name+Semester","Name+SemesterLookup","SemesterNum","Duplicate","Unknown","Not corecs","Error?","Pass/Fail or SUS?","corecs","programming1","programming2","formalreasoning","discretemath","complimitations","algorithms","intermediatealgorithms","systems","computationandtheworld","ai","advancedcs",null,null,"Exception tags","corecs","programming1","programming2","formalreasoning","discretemath","complimitations","algorithms","intermediatealgorithms","systems","computationandtheworld","ai","advancedcs"]
["Is Honors?",{"$f":"OR($B$5=\"Honors\")","v":false},{"$nulls":5},"A-",{"v":3.67,"d":"3.670"},null,null,"Spring 2016",2,null,1,{"$f":"UPPER(SUBSTITUTE(IF(OR(PlanOfStudy!$C17=\"None\",$O6>$B$13),\"\",PlanOfStudy!$C17), \" \", \"\"))","v":""},{"$f":"_xlfn.XLOOKUP($P6,Courses!A:A,Courses!A:A,_xlfn.XLOOKUP($P6,Courses!E:E,Courses!A:A,_xlfn.XLOOKUP($P6,Courses!F:F,Courses!A:A,_xlfn.XLOOKUP($P6,Courses!G:G,Courses!A:A,\"\"))))","v":""},{"$f":"Q6&\":\"&IF(PlanOfStudy!D17<>\"\",PlanOfStudy!D17,\"\")","v":":"},{"$f":"_xlfn.XLOOKUP(R6,Courses!B:B,Courses!B:B,_xlfn.XLOOKUP(Q6&\":\",Courses!B:B,Courses!B:B,\"\"))","v":":"},{"$f":"IF(PlanOfStudy!D17<>\"\",_xlfn.XLOOKUP(PlanOfStudy!D17,$L$5:$L$43,$M$5:$M$43),\"\")","v":""},false,{"$f":"AND(P6<>\"\",Q6=\"\")","v":false},{"$f":"AND(NOT(V6),Z6<>1,P6<>\"\")","v":false},{"$f":"OR(U6:W6)","v":false},{"$f":"AND(PlanOfStudy!$E17<>\"Letter\",PlanOfStudy!$E17<>\"SEM/UEM\",PlanOfStudy!$E17<>\"\",$P6<>\"\")","v":false},{"$f":"IF(AO6,1,IFERROR(IF(FIND(Z$5,_xlfn.XLOOKUP($S6,Courses!$B$2:B$1000, Courses!$X$2:X$1000))>=0,1,\"\"),\"\"))","v":""},{"$f":"IF(AP6,1,IFERROR(IF(AND(FIND(AA$5,_xlfn.XLOOKUP($S6,Courses!$B$2:B$1000, Courses!$X$2:X$1000))>=0,OR(NOT($Y6),AA$3)),1,\"\"),\"\"))","v":""},{"$f":"IF(AQ6,1,IFERROR(IF(AND(FIND(AB$5,_xlfn.XLOOKUP($S6,Courses!$B$2:B$1000, Courses!$X$2:X$1000))>=0,OR(NOT($Y6),AB$3)),1,\"\"),\"\"))","v":""},{"$f":"IF(AR6,1,IFERROR(IF(AND(FIND(AC$5,_xlfn.XLOOKUP($S6,Courses!$B$2:B$1000, Courses!$X$2:X$1000))>=0,OR(NOT($Y6),AC$3)),1,\"\"),\"\"))","v":""},{"$f":"IF(AS6,1,IFERROR(IF(AND(FIND(AD$5,_xlfn.XLOOKUP($S6,Courses!$B$2:B$1000, Courses!$X$2:X$1000))>=0,OR(NOT($Y6),AD$3)),1,\"\"),\"\"))","v":""},{"$f":"IF(AT6,1,IFERROR(IF(AND(FIND(AE$5,_xlfn.XLOOKUP($S6,Courses!$B$2:B$1000, Courses!$X$2:X$1000))>=0,OR(NOT($Y6),AE$3)),1,\"\"),\"\"))","v":""},{"$f":"IF(AU6,1,IFERROR(IF(AND(FIND(AF$5,_xlfn.XLOOKUP($S6,Courses!$B$2:B$1000, Courses!$X$2:X$1000))>=0,OR(NOT($Y6),AF$3)),1,\"\"),\"\"))","v":""},{"$f":"IF(AV6,1,IFERROR(IF(AND(FIND(AG$5,_xlfn.XLOOKUP($S6,Courses!$B$2:B$1000, Courses!$X$2:X$1000))>=0,OR(NOT($Y6),AG$3)),1,\"\"),\"\"))","v":""},{"$f":"IF(AW6,1,IFERROR(IF(AND(FIND(AH$5,_xlfn.XLOOKUP($S6,Courses!$B$2:B$1000, Courses!$X$2:X$1000))>=0,OR(NOT($Y6),AH$3)),1,\"\"),\"\"))","v":""},{"$f":"IF(AX6,1,IFERROR(IF(AND(FIND(AI$5,_xlfn.XLOOKUP($S6,Courses!$B$2:B$1000, Courses!$X$2:X$1000))>=0,OR(NOT($Y6),AI$3)),1,\"\"),\"\"))","v":""},{"$f":"IF(AY6,1,IFERROR(IF(AND(FIND(AJ$5,_xlfn.XLOOKUP($S6,Courses!$B$2:B$1000, Courses!$X$2:X$1000))>=0,OR(NOT($Y6),AJ$3)),1,\"\"),\"\"))","v":""},{"$f":"IF(AZ6,1,IFERROR(IF(FIND(AK$5,_xlfn.XLOOKUP($S6,Courses!$B$2:B$1000, Courses!$X$2:X$1000))>=0,1,NA()),IF(AND(Q6=\"CS91R\",$B$9),1,\"\")))","v":""},null,null,{"$f":"IF(AND(PlanOfStudy!$F17<>\"\",$V6),LOWER(SUBSTITUTE(PlanOfStudy!$F17, \" \", \"\")),\"\")","v":""},{"$f":"ISNUMBER(FIND(AO$5,$AN6))","v":false},{"$f":"ISNUMBER(FIND(AP$5,$AN6))","v":false},false,false,false,false,false,false,false,false,false,false]
["Is MBB?",{"$f":"$B$5=\"MBB\"","v":false},{"$nulls":5},"B+",{"v":3.33,"d":"3.330"},null,null,"Fall 2016",3,null,2,{"$f":"UPPER(SUBSTITUTE(IF(OR(PlanOfStudy!$C18=\"None\",$O7>$B$13),\"\",PlanOfStudy!$C18), \" \", \"\"))","v":""},{"$f":"_xlfn.XLOOKUP($P7,Courses!A:A,Courses!A:A,_xlfn.XLOOKUP($P7,Courses!E:E,Courses!A:A,_xlfn.XLOOKUP($P7,Courses!F:F,Courses!A:A,_xlfn.XLOOKUP($P7,Courses!G:G,Courses!A:A,\"\"))))","v":""},{"$f":"Q7&\":\"&IF(PlanOfStudy!D18<>\"\",PlanOfStudy!D18,\"\")","v":":"},{"$f":"_xlfn.XLOOKUP(R7,Courses!B:B,Courses!B:B,_xlfn.XLOOKUP(Q7&\":\",Courses!B:B,Courses!B:B,\"\"))","v":":"},{"$f":"IF(PlanOfStudy!D18<>\"\",_xlfn.XLOOKUP(PlanOfStudy!D18,$L$5:$L$43,$M$5:$M$43),\"\")","v":""},{"$f":"OR(AND(P7<>\"\",P7=P6),AND(Q7<>\"\",Q7=Q6))","v":false},{"$f":"AND(P7<>\"\",Q7=\"\")","v":false},{"$f":"AND(NOT(V7),Z7<>1,P7<>\"\")","v":false},{"$f":"OR(U7:W7)","v":false},{"$f":"AND(PlanOfStudy!$E18<>\"Letter\",PlanOfStudy!$E18<>\"SEM/UEM\",PlanOfStudy!$E18<>\"\",$P7<>\"\")","v":false},{"$f":"IF(AO7,1,IFERROR(IF(FIND(Z$5,_xlfn.XLOOKUP($S7,Courses!$B$2:B$1000, Courses!$X$2:X$1000))>=0,1,\"\"),\"\"))","v":""},{"$f":"IF(AP7,1,IFERROR(IF(AND(FIND(AA$5,_xlfn.XLOOKUP($S7,Courses!$B$2:B$1000, Courses!$X$2:X$1000))>=0,OR(NOT($Y7),AA$3)),1,\"\"),\"\"))","v":""},{"$f":"IF(AQ7,1,IFERROR(IF(AND(FIND(AB$5,_xlfn.XLOOKUP($S7,Courses!$B$2:B$1000, Courses!$X$2:X$1000))>=0,OR(NOT($Y7),AB$3)),1,\"\"),\"\"))","v":""},{"$f":"IF(AR7,1,IFERROR(IF(AND(FIND(AC$5,_xlfn.XLOOKUP($S7,Courses!$B$2:B$1000, Courses!$X$2:X$1000))>=0,OR(NOT($Y7),AC$3)),1,\"\"),\"\"))","v":""},{"$f":"IF(AS7,1,IFERROR(IF(AND(FIND(AD$5,_xlfn.XLOOKUP($S7,Courses!$B$2:B$1000, Courses!$X$2:X$1000))>=0,OR(NOT($Y7),AD$3)),1,\"\"),\"\"))","v":""},{"$f":"IF(AT7,1,IFERROR(IF(AND(FIND(AE$5,_xlfn.XLOOKUP($S7,Courses!$B$2:B$1000, Courses!$X$2:X$1000))>=0,OR(NOT($Y7),AE$3)),1,\"\"),\"\"))","v":""},{"$f":"IF(AU7,1,IFERROR(IF(AND(FIND(AF$5,_xlfn.XLOOKUP($S7,Courses!$B$2:B$1000, Courses!$X$2:X$1000))>=0,OR(NOT($Y7),AF$3)),1,\"\"),\"\"))","v":""},{"$f":"IF(AV7,1,IFERROR(IF(AND(FIND(AG$5,_xlfn.XLOOKUP($S7,Courses!$B$2:B$1000, Courses!$X$2:X$1000))>=0,OR(NOT($Y7),AG$3)),1,\"\"),\"\"))","v":""},{"$f":"IF(AW7,1,IFERROR(IF(AND(FIND(AH$5,_xlfn.XLOOKUP($S7,Courses!$B$2:B$1000, Courses!$X$2:X$1000))>=0,OR(NOT($Y7),AH$3)),1,\"\"),\"\"))","v":""},{"$f":"IF(AX7,1,IFERROR(IF(AND(FIND(AI$5,_xlfn.XLOOKUP($S7,Courses!$B$2:B$1000, Courses!$X$2:X$1000))>=0,OR(NOT($Y7),AI$3)),1,\"\"),\"\"))","v":""},{"$f":"IF(AY7,1,IFERROR(IF(AND(FIND(AJ$5,_xlfn.XLOOKUP($S7,Courses!$B$2:B$1000, Courses!$X$2:X$1000))>=0,OR(NOT($Y7),AJ$3)),1,\"\"),\"\"))","v":""},{"$f":"IF(AZ7,1,IFERROR(IF(FIND(AK$5,_xlfn.XLOOKUP($S7,Courses!$B$2:B$1000, Courses!$X$2:X$1000))>=0,1,NA()),IF(AND(Q7=\"CS91R\",$B$9),1,\"\")))","v":""},null,null,{"$f":"IF(AND(PlanOfStudy!$F18<>\"\",$V7),LOWER(SUBSTITUTE(PlanOfStudy!$F18, \" \", \"\")),\"\")","v":""},{"$f":"ISNUMBER(FIND(AO$5,$AN7))","v":false},false,false,false,false,false,false,false,false,false,false,false]
["Is Joint?",{"$f":"$B$5=\"Joint\"","v":false},{"$nulls":5},"B",{"v":3,"d":"3.000"},null,null,"Spring 2017",4,null,3,{"$f":"UPPER(SUBSTITUTE(IF(OR(PlanOfStudy!$C19=\"None\",$O8>$B$13),\"\",PlanOfStudy!$C19), \" \", \"\"))","v":""},{"$f":"_xlfn.XLOOKUP($P8,Courses!A:A,Courses!A:A,_xlfn.XLOOKUP($P8,Courses!E:E,Courses!A:A,_xlfn.XLOOKUP($P8,Courses!F:F,Courses!A:A,_xlfn.XLOOKUP($P8,Courses!G:G,Courses!A:A,\"\"))))","v":""},{"$f":"Q8&\":\"&IF(PlanOfStudy!D19<>\"\",PlanOfStudy!D19,\"\")","v":":"},{"$f":"_xlfn.XLOOKUP(R8,Courses!B:B,Courses!B:B,_xlfn.XLOOKUP(Q8&\":\",Courses!B:B,Courses!B:B,\"\"))","v":":"},{"$f":"IF(PlanOfStudy!D19<>\"\",_xlfn.XLOOKUP(PlanOfStudy!D19,$L$5:$L$43,$M$5:$M$43),\"\")","v":""},{"$f":"OR(AND(P8<>\"\",COUNTIF($P$6:$P7,\"=\"&$P8)>0),AND(Q8<>\"\",COUNTIF($Q$6:$Q7,\"=\"&$Q8)>0))","v":false},false,false,false,{"$f":"AND(PlanOfStudy!$E19<>\"Letter\",PlanOfStudy!$E19<>\"SEM/UEM\",PlanOfStudy!$E19<>\"\",$P8<>\"\")","v":false},{"$f":"IF(AO8,1,IFERROR(IF(FIND(Z$5,_xlfn.XLOOKUP($S8,Courses!$B$2:B$1000, Courses!$X$2:X$1000))>=0,1,\"\"),\"\"))","v":""},{"$f":"IF(AP8,1,IFERROR(IF(AND(FIND(AA$5,_xlfn.XLOOKUP($S8,Courses!$B$2:B$1000, Courses!$X$2:X$1000))>=0,OR(NOT($Y8),AA$3)),1,\"\"),\"\"))","v":""},{"$f":"IF(AQ8,1,IFERROR(IF(AND(FIND(AB$5,_xlfn.XLOOKUP($S8,Courses!$B$2:B$1000, Courses!$X$2:X$1000))>=0,OR(NOT($Y8),AB$3)),1,\"\"),\"\"))","v":""},{"$f":"IF(AR8,1,IFERROR(IF(AND(FIND(AC$5,_xlfn.XLOOKUP($S8,Courses!$B$2:B$1000, Courses!$X$2:X$1000))>=0,OR(NOT($Y8),AC$3)),1,\"\"),\"\"))","v":""},{"$f":"IF(AS8,1,IFERROR(IF(AND(FIND(AD$5,_xlfn.XLOOKUP($S8,Courses!$B$2:B$1000, Courses!$X$2:X$1000))>=0,OR(NOT($Y8),AD$3)),1,\"\"),\"\"))","v":""},{"$f":"IF(AT8,1,IFERROR(IF(AND(FIND(AE$5,_xlfn.XLOOKUP($S8,Courses!$B$2:B$1000, Courses!$X$2:X$1000))>=0,OR(NOT($Y8),AE$3)),1,\"\"),\"\"))","v":""},{"$f":"IF(AU8,1,IFERROR(IF(AND(FIND(AF$5,_xlfn.XLOOKUP($S8,Courses!$B$2:B$1000, Courses!$X$2:X$1000))>=0,OR(NOT($Y8),AF$3)),1,\"\"),\"\"))","v":""},{"$f":"IF(AV8,1,IFERROR(IF(AND(FIND(AG$5,_xlfn.XLOOKUP($S8,Courses!$B$2:B$1000, Courses!$X$2:X$1000))>=0,OR(NOT($Y8),AG$3)),1,\"\"),\"\"))","v":""},{"$f":"IF(AW8,1,IFERROR(IF(AND(FIND(AH$5,_xlfn.XLOOKUP($S8,Courses!$B$2:B$1000, Courses!$X$2:X$1000))>=0,OR(NOT($Y8),AH$3)),1,\"\"),\"\"))","v":""},{"$f":"IF(AX8,1,IFERROR(IF(AND(FIND(AI$5,_xlfn.XLOOKUP($S8,Courses!$B$2:B$1000, Courses!$X$2:X$1000))>=0,OR(NOT($Y8),AI$3)),1,\"\"),\"\"))","v":""},{"$f":"IF(AY8,1,IFERROR(IF(AND(FIND(AJ$5,_xlfn.XLOOKUP($S8,Courses!$B$2:B$1000, Courses!$X$2:X$1000))>=0,OR(NOT($Y8),AJ$3)),1,\"\"),\"\"))","v":""},{"$f":"IF(AZ8,1,IFERROR(IF(FIND(AK$5,_xlfn.XLOOKUP($S8,Courses!$B$2:B$1000, Courses!$X$2:X$1000))>=0,1,NA()),IF(AND(Q8=\"CS91R\",$B$9),1,\"\")))","v":""},null,null,{"$f":"IF(AND(PlanOfStudy!$F19<>\"\",$V8),LOWER(SUBSTITUTE(PlanOfStudy!$F19, \" \", \"\")),\"\")","v":""},false,false,false,false,false,false,false,false,false,false,false,false]
["Is 91r allowed as advanced CS?",{"$f":"OR(B7,B8)","v":false},{"$nulls":5},"B-",{"v":2.67,"d":"2.670"},null,null,"Fall 2017",5,null,4,{"$f":"UPPER(SUBSTITUTE(IF(OR(PlanOfStudy!$C20=\"None\",$O9>$B$13),\"\",PlanOfStudy!$C20), \" \", \"\"))","v":""},{"$f":"_xlfn.XLOOKUP($P9,Courses!A:A,Courses!A:A,_xlfn.XLOOKUP($P9,Courses!E:E,Courses!A:A,_xlfn.XLOOKUP($P9,Courses!F:F,Courses!A:A,_xlfn.XLOOKUP($P9,Courses!G:G,Courses!A:A,\"\"))))","v":""},{"$f":"Q9&\":\"&IF(PlanOfStudy!D20<>\"\",PlanOfStudy!D20,\"\")","v":":"},{"$f":"_xlfn.XLOOKUP(R9,Courses!B:B,Courses!B:B,_xlfn.XLOOKUP(Q9&\":\",Courses!B:B,Courses!B:B,\"\"))","v":":"},{"$f":"IF(PlanOfStudy!D20<>\"\",_xlfn.XLOOKUP(PlanOfStudy!D20,$L$5:$L$43,$M$5:$M$43),\"\")","v":""},{"$f":"OR(AND(P9<>\"\",COUNTIF($P$6:$P8,\"=\"&$P9)>0),AND(Q9<>\"\",COUNTIF($Q$6:$Q8,\"=\"&$Q9)>0))","v":false},false,false,false,{"$f":"AND(PlanOfStudy!$E20<>\"Letter\",PlanOfStudy!$E20<>\"SEM/UEM\",PlanOfStudy!$E20<>\"\",$P9<>\"\")","v":false},{"$f":"IF(AO9,1,IFERROR(IF(FIND(Z$5,_xlfn.XLOOKUP($S9,Courses!$B$2:B$1000, Courses!$X$2:X$1000))>=0,1,\"\"),\"\"))","v":""},{"$f":"IF(AP9,1,IFERROR(IF(AND(FIND(AA$5,_xlfn.XLOOKUP($S9,Courses!$B$2:B$1000, Courses!$X$2:X$1000))>=0,OR(NOT($Y9),AA$3)),1,\"\"),\"\"))","v":""},{"$f":"IF(AQ9,1,IFERROR(IF(AND(FIND(AB$5,_xlfn.XLOOKUP($S9,Courses!$B$2:B$1000, Courses!$X$2:X$1000))>=0,OR(NOT($Y9),AB$3)),1,\"\"),\"\"))","v":""},{"$f":"IF(AR9,1,IFERROR(IF(AND(FIND(AC$5,_xlfn.XLOOKUP($S9,Courses!$B$2:B$1000, Courses!$X$2:X$1000))>=0,OR(NOT($Y9),AC$3)),1,\"\"),\"\"))","v":""},{"$f":"IF(AS9,1,IFERROR(IF(AND(FIND(AD$5,_xlfn.XLOOKUP($S9,Courses!$B$2:B$1000, Courses!$X$2:X$1000))>=0,OR(NOT($Y9),AD$3)),1,\"\"),\"\"))","v":""},{"$f":"IF(AT9,1,IFERROR(IF(AND(FIND(AE$5,_xlfn.XLOOKUP($S9,Courses!$B$2:B$1000, Courses!$X$2:X$1000))>=0,OR(NOT($Y9),AE$3)),1,\"\"),\"\"))","v":""},{"$f":"IF(AU9,1,IFERROR(IF(AND(FIND(AF$5,_xlfn.XLOOKUP($S9,Courses!$B$2:B$1000, Courses!$X$2:X$1000))>=0,OR(NOT($Y9),AF$3)),1,\"\"),\"\"))","v":""},{"$f":"IF(AV9,1,IFERROR(IF(AND(FIND(AG$5,_xlfn.XLOOKUP($S9,Courses!$B$2:B$1000, Courses!$X$2:X$1000))>=0,OR(NOT($Y9),AG$3)),1,\"\"),\"\"))","v":""},{"$f":"IF(AW9,1,IFERROR(IF(AND(FIND(AH$5,_xlfn.XLOOKUP($S9,Courses!$B$2:B$1000, Courses!$X$2:X$1000))>=0,OR(NOT($Y9),AH$3)),1,\"\"),\"\"))","v":""},{"$f":"IF(AX9,1,IFERROR(IF(AND(FIND(AI$5,_xlfn.XLOOKUP($S9,Courses!$B$2:B$1000, Courses!$X$2:X$1000))>=0,OR(NOT($Y9),AI$3)),1,\"\"),\"\"))","v":""},{"$f":"IF(AY9,1,IFERROR(IF(AND(FIND(AJ$5,_xlfn.XLOOKUP($S9,Courses!$B$2:B$1000, Courses!$X$2:X$1000))>=0,OR(NOT($Y9),AJ$3)),1,\"\"),\"\"))","v":""},{"$f":"IF(AZ9,1,IFERROR(IF(FIND(AK$5,_xlfn.XLOOKUP($S9,Courses!$B$2:B$1000, Courses!$X$2:X$1000))>=0,1,NA()),IF(AND(Q9=\"CS91R\",$B$9),1,\"\")))","v":""},null,null,{"$f":"IF(AND(PlanOfStudy!$F20<>\"\",$V9),LOWER(SUBSTITUTE(PlanOfStudy!$F20, \" \", \"\")),\"\")","v":""},false,false,false,false,false,false,false,false,false,false,false,false]
[{"$nulls":7},"C+",{"v":2.33,"d":"2.330"},null,null,"Spring 2018",6,null,5,{"$f":"UPPER(SUBSTITUTE(IF(OR(PlanOfStudy!$C21=\"None\",$O10>$B$13),\"\",PlanOfStudy!$C21), \" \", \"\"))","v":""},{"$f":"_xlfn.XLOOKUP($P10,Courses!A:A,Courses!A:A,_xlfn.XLOOKUP($P10,Courses!E:E,Courses!A:A,_xlfn.XLOOKUP($P10,Courses!F:F,Courses!A:A,_xlfn.XLOOKUP($P10,Courses!G:G,Courses!A:A,\"\"))))","v":""},{"$f":"Q10&\":\"&IF(PlanOfStudy!D21<>\"\",PlanOfStudy!D21,\"\")","v":":"},{"$f":"_xlfn.XLOOKUP(R10,Courses!B:B,Courses!B:B,_xlfn.XLOOKUP(Q10&\":\",Courses!B:B,Courses!B:B,\"\"))","v":":"},{"$f":"IF(PlanOfStudy!D21<>\"\",_xlfn.XLOOKUP(PlanOfStudy!D21,$L$5:$L$43,$M$5:$M$43),\"\")","v":""},{"$f":"OR(AND(P10<>\"\",COUNTIF($P$6:$P9,\"=\"&$P10)>0),AND(Q10<>\"\",COUNTIF($Q$6:$Q9,\"=\"&$Q10)>0))","v":false},false,false,false,{"$f":"AND(PlanOfStudy!$E21<>\"Letter\",PlanOfStudy!$E21<>\"SEM/UEM\",PlanOfStudy!$E21<>\"\",$P10<>\"\")","v":false},{"$f":"IF(AO10,1,IFERROR(IF(FIND(Z$5,_xlfn.XLOOKUP($S10,Courses!$B$2:B$1000, Courses!$X$2:X$1000))>=0,1,\"\"),\"\"))","v":""},{"$f":"IF(AP10,1,IFERROR(IF(AND(FIND(AA$5,_xlfn.XLOOKUP($S10,Courses!$B$2:B$1000, Courses!$X$2:X$1000))>=0,OR(NOT($Y10),AA$3)),1,\"\"),\"\"))","v":""},{"$f":"IF(AQ10,1,IFERROR(IF(AND(FIND(AB$5,_xlfn.XLOOKUP($S10,Courses!$B$2:B$1000, Courses!$X$2:X$1000))>=0,OR(NOT($Y10),AB$3)),1,\"\"),\"\"))","v":""},{"$f":"IF(AR10,1,IFERROR(IF(AND(FIND(AC$5,_xlfn.XLOOKUP($S10,Courses!$B$2:B$1000, Courses!$X$2:X$1000))>=0,OR(NOT($Y10),AC$3)),1,\"\"),\"\"))","v":""},{"$f":"IF(AS10,1,IFERROR(IF(AND(FIND(AD$5,_xlfn.XLOOKUP($S10,Courses!$B$2:B$1000, Courses!$X$2:X$1000))>=0,OR(NOT($Y10),AD$3)),1,\"\"),\"\"))","v":""},{"$f":"IF(AT10,1,IFERROR(IF(AND(FIND(AE$5,_xlfn.XLOOKUP($S10,Courses!$B$2:B$1000, Courses!$X$2:X$1000))>=0,OR(NOT($Y10),AE$3)),1,\"\"),\"\"))","v":""},{"$f":"IF(AU10,1,IFERROR(IF(AND(FIND(AF$5,_xlfn.XLOOKUP($S10,Courses!$B$2:B$1000, Courses!$X$2:X$1000))>=0,OR(NOT($Y10),AF$3)),1,\"\"),\"\"))","v":""},{"$f":"IF(AV10,1,IFERROR(IF(AND(FIND(AG$5,_xlfn.XLOOKUP($S10,Courses!$B$2:B$1000, Courses!$X$2:X$1000))>=0,OR(NOT($Y10),AG$3)),1,\"\"),\"\"))","v":""},{"$f":"IF(AW10,1,IFERROR(IF(AND(FIND(AH$5,_xlfn.XLOOKUP($S10,Courses!$B$2:B$1000, Courses!$X$2:X$1000))>=0,OR(NOT($Y10),AH$3)),1,\"\"),\"\"))","v":""},{"$f":"IF(AX10,1,IFERROR(IF(AND(FIND(AI$5,_xlfn.XLOOKUP($S10,Courses!$B$2:B$1000, Courses!$X$2:X$1000))>=0,OR(NOT($Y10),AI$3)),1,\"\"),\"\"))","v":""},{"$f":"IF(AY10,1,IFERROR(IF(AND(FIND(AJ$5,_xlfn.XLOOKUP($S10,Courses!$B$2:B$1000, Courses!$X$2:X$1000))>=0,OR(NOT($Y10),AJ$3)),1,\"\"),\"\"))","v":""},{"$f":"IF(AZ10,1,IFERROR(IF(FIND(AK$5,_xlfn.XLOOKUP($S10,Courses!$B$2:B$1000, Courses!$X$2:X$1000))>=0,1,NA()),IF(AND(Q10=\"CS91R\",$B$9),1,\"\")))","v":""},null,null,{"$f":"IF(AND(PlanOfStudy!$F21<>\"\",$V10),LOWER(SUBSTITUTE(PlanOfStudy!$F21, \" \", \"\")),\"\")","v":""},false,false,false,false,false,false,false,false,false,false,false,false]
{"$rows_left_out":72}
{"sheet":"Instructions","index":3,"n_rows":26,"n_cols":2,"rows_kept":26,"hidden":true}
["Instructions"]
[]
[null,"This sheet contains information about how this spreadsheet is set up, how to update this spreadsheet, and how to release it."]
[]
["Description of Tabs"]
[null,"The PlanOfStudy tab is the one that students fill in. Play around with it to understand what cells are enabled when (e.g., based on Basic, Honors, Joint, etc., unknown courses, etc.)"]
[null,"The Courses tab is the data about courses. This tab performs only minimal computation (Columns A and B)"]
[null,"The Computations tab is where all of the checking of courses happens, looking up to see what tags a course satisfies, checking the requirements, and computing appropriate error messages. "]
[]
[]
{"$rows_left_out":17}
{"sheet":"VersionInfo","index":4,"n_rows":23,"n_cols":3,"rows_kept":23,"hidden":true}
["Version","Date","Note"]
["0.0.1","2021-06-15","Initial creation"]
["0.0,2","2021-06-28","New course sheet format, including by requirements by semester. Note that we use XLOOKUP now"]
["1.0.0","2021-07-12","Initial release and fix duplicate checking code"]
["1.0.1","2021-07-20","Add SEM/UEM grading"]
["1.0.2","2021-08-24","Allow manually entered tags"]
["1.0.3","2021-08-27","Discrete Math tag feedback"]
["1.0.4","2021-11-06","Add message about total number of CS Core courses"]
["1.0.5","2022-01-13","Updated course tags"]
["1.0.6","2022-01-16","Fix bug in course tab"]
{"$rows_left_out":13}